ارور هنگام ران کردن پروژه

- 1 هفته پیش
توسط miad noori آپدیت شد
miad noori ( 120 تجربه )
1 هفته پیش

با سلام
وقتی میخوام پروژرو ران کنم به این مشکل بر میخورم طبق اموزش همه چیو درست رفتم جلو ممنون میشم راهنماییم کنید@hesammousavi @ali.bayat
یه اخطار توی فلاتر داکتر دارم نمیدونم شاید از اون باشه

C:\\Windows\\System32\\myapp>flutter run  
Using hardware rendering with device Android SDK built for x86. If you get graphics artifacts, consider enabling  
software rendering with "--enable-software-rendering".  
Launching lib/main.dart on Android SDK built for x86 in debug mode...  
Initializing gradle... 1.0s  
Resolving dependencies... 15.6s

FAILURE: Build failed with an exception.

- What went wrong:  
  Execution failed for task ':app:mergeDebugResources'.

  > java.util.concurrent.ExecutionException: com.android.builder.internal.aapt.v2.Aapt2Exception: Android resource compilation failed  
  > C:\\Windows\\System32\\myapp\\build\\app\\intermediates\\res\\merged\\debug: error: directory does not exist.
- Try:  
  Run with --stacktrace option to get the stack trace. Run with --info or --debug option to get more log output. Run with --scan to get full insights.
- Get more help at <https://help.gradle.org>

BUILD FAILED in 3s  
Running Gradle task 'assembleDebug'...  
Running Gradle task 'assembleDebug'... Done 3.9s  
Gradle task assembleDebug failed with exit code 1
الیاس بشکنی ( 16835 تجربه )
1 هفته پیش
تخصص : برنامه نویس موبایل

دوست عزیز کدهاتون رو بین سه تا بک تیک بذارین
اینجا رو مطالعه کنید >> https://roocket.ir/articles/learn-use-markdown


واسه ارورتون
ارور توی فلاتر داکترتون که فک نکنم مورد مهمی باشه
اما برای بیلدشدن درست پروژه از سرویس های زیر استفاده کنید
https://shecan.ir
https://begzar.ir
https://github.com/freedomofdevelopers/fod

miad noori ( 120 تجربه )
1 هفته پیش

دوست عزیز طبق آموزش آقای موسوی من حتی *** هم خریدم و روی cisco هم تنظیم کردم ولی باز متاسفانه نشد
@hesammousavi
لطفا راهنمایی بفرمایید

برای ارسال پاسخ باید وارد سایت شوید