خطا موقع ران کردن پروژه

4 روز پیش توسط جوادجوینده آپدیت شد
آفلاین
user-avatar
جوادجوینده ( 80 تجربه )
5 روز پیش

لینک کوتاه اشتراک گذاری

0

FAILURE: Build failed with an exception.

  • What went wrong:
    Could not determine the dependencies of task ‘:app:compileDebugJavaWithJavac’.

    Failed to find Build Tools revision 29.0.2

  • Try:
    Run with –stacktrace option to get the stack trace. Run with –info or –debug option to get more log output. Run with –scan to get full insights.
  • Get more help at https://help.gradle.org

BUILD FAILED in 4s
Exception: Gradle task assembleDebug failed with exit code 1
سلام وقت بخیرموقع ران کردن این خطا رو بهم میده من پروکسی کریو میکر هم ران کردم ولی بازم این خطا رو بهم میده

آفلاین
user-avatar
سبحان مولایی ( 67114 تجربه )
4 روز پیش
تخصص : برنامه‌نویس وب: Python :: Django :: Node :: Php :: Laravel :: JS

لینک کوتاه اشتراک گذاری

0

سلام فکر کنم این لینک به شما کمک کنه

آفلاین
user-avatar
جوادجوینده ( 80 تجربه )
4 روز پیش

لینک کوتاه اشتراک گذاری

0

مرسی واقعا مشکلم حل شد

برای ارسال پاسخ لازم است، ابتدا وارد سایت شوید.