0 دنبال کننده
0 دنبال شونده

آخرین گفتگوها ایجاد شده

خطا هنگام اجرای برنامه react native run android

اندروید
- 1 هفته پیش

سلام موقعی که برنامه react native run android میزنم خطایه زیر رو میده " Task :app:installDebug FAILED FAILURE: Build failed with an exception. What went wrong: Execution failed for task ':app:installDebug'. com.android.builder.testing.api.DeviceException: No connected devices! Try: Run with --stacktrace option to get the stack trace. Run with --info or --debug option to get more log o...

0 پاسخ