آفلاین
user-avatar

خطا هنگام build شدن gradle

11 ماه پیش
توسط زهره آپدیت شد
آفلاین
user-avatar
محمود ( 654 تجربه )
2 سال پیش

با سلام.بعداز ساخت پروژه جدید ری اکت نیتیو وقتی
com.android.tools.build:gradle:2.2.3
را به
com.android.tools.build:gradle:2.1.3
تغییر دادم.
هنگام بیلد شدن گریدل به خطای زیر برخوردم :

Error:org.gradle.api.internal.tasks.DefaultTaskInputs$TaskInputUnionFileCollection cannot be cast to org.gradle.api.internal.file.collections.DefaultConfigurableFileCollection
Possible causes for this unexpected error include:<ul><li>Gradle's dependency cache may be corrupt (this sometimes occurs after a network connection timeout.)
<a href="syncProject">Re-download dependencies and sync project (requires network)</a></li><li>The state of a Gradle build process (daemon) may be corrupt. Stopping all Gradle daemons may solve this problem.
<a href="stopGradleDaemons">Stop Gradle build processes (requires restart)</a></li><li>Your project may be using a third-party plugin which is not compatible with the other plugins in the project or the version of Gradle requested by the project.</li></ul>In the case of corrupt Gradle processes, you can also try closing the IDE and then killing all Java processes.
بهترین پاسخ انتخاب شده توسط محمود
آفلاین
user-avatar
محمود
2 سال پیش

نسخه گریدل را از gradle-3.5.1 بهgradle-2.14.11 تغییر دادم درست شد.
com.android.tools.build:gradle:۲.۱.۳ با گریدل نسخه 3 سازگاری نداشت
وارد فایل زیر شدم
Gradle Scripts > gradle-wrapper.properties
تغییر

distributionUrl=https://services.gradle.org/distributions/gradle-3.5.1-all.zip

به

distributionUrl=https://services.gradle.org/distributions/gradle-2.14.1-all.zip

cleane project
rebuild project

آفلاین
user-avatar
Shahdad Alasti ( 5035 تجربه )
2 سال پیش

سلام ، من هم همین مشکل رو دارم با این تفاوت که
com.android.tools.build:gradle:2.3.3
را به
com.android.tools.build:gradle:2.1.3
تغییر دادم.
لطفا راهنمایی کنین

آفلاین
user-avatar
محمود ( 654 تجربه )
2 سال پیش

نسخه گریدل را از gradle-3.5.1 بهgradle-2.14.11 تغییر دادم درست شد.
com.android.tools.build:gradle:۲.۱.۳ با گریدل نسخه 3 سازگاری نداشت
وارد فایل زیر شدم
Gradle Scripts > gradle-wrapper.properties
تغییر

distributionUrl=https://services.gradle.org/distributions/gradle-3.5.1-all.zip

به

distributionUrl=https://services.gradle.org/distributions/gradle-2.14.1-all.zip

cleane project
rebuild project

آفلاین
user-avatar
Alice Lomines ( 980 تجربه )
1 سال پیش

در 12:13

درود آقا من تقریبا همین ارر.ر را داترم که در زیر اررور اصلی را می گذارم
و نمی توانم در یونیتی و در حالت gradle خروجی بگیرم در اندروید استدیو هم گریدل سینک می شود و فقط قسمت آخر آن که resolve…. است سینک نمی شود و دقیقا همان اروری که ر یونیتی است و ددر زیر می گذارم را نشان می دهم آیا این اررور ربطی به sdk دارد ون شخصی با مبلغ بالا می خواه sdk به من بفروشد و می گوید مشکل حل میشود یا نه به گریدل ربط دارد ؟؟

من چطور این اررور را برطرف کنم هر چه سریعتر کمک کنید سه ماه است درگیرش هستم



stderr[

FAILURE: Build failed with an exception.

* What went wrong:
A problem occurred configuring root project ‘gradleOut’.
> Could not resolve all artifacts for configuration ‘:classpath’.
> Could not resolve com.android.tools.build:gradle:2.3.0.
Required by:
project :
> Could not resolve com.android.tools.build:gradle:2.3.0.
> Could not get resource ‘https://jcenter.bintray.com/com/android/tools/build/gradle/2.3.0/gradle-2.3.0.pom’.
> Could not HEAD ‘https://jcenter.bintray.com/com/android/tools/build/gradle/2.3.0/gradle-2.3.0.pom’.
> jcenter.bintray.com

* Try:
Run with –stacktrace option to get the stack trace. Run with –info or –debug option to get more log output. Run with –scan to get full insights.

* Get more help at https://help.gradle.org

BUILD FAILED in 32s
]
stdout[
Starting a Gradle Daemon (subsequent builds will be faster)
]
exit code: 1
UnityEditor.Android.Command.WaitForProgramToRun (UnityEditor.Utils.Program p, UnityEditor.Android.WaitingForProcessToExit waitingForProcessToExit, System.String errorMsg)
UnityEditor.Android.Command.Run (System.Diagnostics.ProcessStartInfo psi, UnityEditor.Android.WaitingForProcessToExit waitingForProcessToExit, System.String errorMsg)
UnityEditor.Android.AndroidJavaTools.RunJava (System.String args, System.String workingdir, System.Action1 progress, System.String error)
UnityEditor.Android.GradleWrapper.Run (System.String workingdir, System.String task, System.Action1 progress)
Rethrow as GradleInvokationException: Gradle build failed
UnityEditor.Android.GradleWrapper.Run (System.String workingdir, System.String task, System.Action1 progress)
UnityEditor.Android.PostProcessor.Tasks.BuildGradleProject.Execute (UnityEditor.Android.PostProcessor.PostProcessorContext context)
UnityEditor.Android.PostProcessor.PostProcessRunner.RunAllTasks (UnityEditor.Android.PostProcessor.PostProcessorContext context)
UnityEngine.GUIUtility:ProcessEvent(Int32, IntPtr)

Build completed with a result of 'Failed'
UnityEngine.GUIUtility:ProcessEvent(Int32, IntPtr)

UnityEditor.BuildPlayerWindow+BuildMethodException: 2 errors
at UnityEditor.BuildPlayerWindow+DefaultBuildMethods.BuildPlayer (BuildPlayerOptions options) [0x0020e] in C:\buildslave\unity\build\Editor\Mono\BuildPlayerWindowBuildMethods.cs:181
at UnityEditor.BuildPlayerWindow.CallBuildMethods (Boolean askForBuildLocation, BuildOptions defaultBuildOptions) [0x00065] in C:\buildslave\unity\build\Editor\Mono\BuildPlayerWindowBuildMethods.cs:88
UnityEngine.GUIUtility:ProcessEvent(Int32, IntPtr)

CommandInvokationFailure: Gradle build failed. C:/Program Files/Java/jdk1.8.0_192\bin\java.exe -classpath "F:\files\pc\Video\artoon\program files\UnitySetup64-2017.4.17f1\Unity\Editor\Data\PlaybackEngines\AndroidPlayer\Tools\gradle\lib\gradle-launcher-4.6.jar" org.gradle.launcher.GradleMain "-Dorg.gradle.jvmargs=-Xmx4096m" "bundleRelease"

stderr[

FAILURE: Build failed with an exception.

Could not resolve all artifacts for configuration ':classpath'. Could not resolve com.android.tools.build:gradle:2.3.0.

Required by: project : > Could not resolve com.android.tools.build:gradle:2.3.0. > Could not get resource 'https://jcenter.bintray.com/com/android/tools/build/gradle/2.3.0/gradle-2.3.0.pom'. > Could not HEAD 'https://jcenter.bintray.com/com/android/tools/build/gradle/2.3.0/gradle-2.3.0.pom'. > jcenter.bintray.com

Try: Run with --stacktrace option to get the stack trace. Run with --info or --debug option to get more log output. Run with --scan to get full insights.

Get more help at https://help.gradle.org

BUILD FAILED in 32s ] stdout[ Starting a Gradle Daemon (subsequent builds will be faster) ] exit code: 1 UnityEditor.Android.Command.WaitForProgramToRun (UnityEditor.Utils.Program p, UnityEditor.Android.WaitingForProcessToExit waitingForProcessToExit, System.String errorMsg) UnityEditor.Android.Command.Run (System.Diagnostics.ProcessStartInfo psi, UnityEditor.Android.WaitingForProcessToExit waitingForProcessToExit, System.String errorMsg) UnityEditor.Android.AndroidJavaTools.RunJava (System.String args, System.String workingdir, System.Action1 progress, System.String error) UnityEditor.Android.GradleWrapper.Run (System.String workingdir, System.String task, System.Action1 progress) Rethrow as GradleInvokationException: Gradle build failed UnityEditor.Android.GradleWrapper.Run (System.String workingdir, System.String task, System.Action1 progress) UnityEditor.Android.PostProcessor.Tasks.BuildGradleProject.Execute (UnityEditor.Android.PostProcessor.PostProcessorContext context) UnityEditor.Android.PostProcessor.PostProcessRunner.RunAllTasks (UnityEditor.Android.PostProcessor.PostProcessorContext context) UnityEngine.GUIUtility:ProcessEvent(Int32, IntPtr)

Build completed with a result of ‘Failed’ UnityEngine.GUIUtility:ProcessEvent(Int32, IntPtr)

UnityEditor.BuildPlayerWindow+BuildMethodException: 2 errors at UnityEditor.BuildPlayerWindow+DefaultBuildMethods.BuildPlayer (BuildPlayerOptions options) [0x0020e] in C:\buildslave\unity\build\Editor\Mono\BuildPlayerWindowBuildMethods.cs:181 at UnityEditor.BuildPlayerWindow.CallBuildMethods (Boolean askForBuildLocation, BuildOptions defaultBuildOptions) [0x00065] in C:\buildslave\unity\build\Editor\Mono\BuildPlayerWindowBuildMethods.cs:88 UnityEngine.GUIUtility:ProcessEvent(Int32, IntPtr)```
آفلاین
user-avatar
Alice Lomines ( 980 تجربه )
1 سال پیش

آقا لطفا پاسخ پرسش مرا با نام
Alice Lominesکه در پایین پستم هست بدهید من سه ماهه در گیر این مشکل هستم
آیا مشکل از اس ی کی است چون شخصی با مبلغ بالا می تواند اس دی کی به من بفروشد آیا با این کار درست میشود یا مشکل از گریدل است من کار باید بکنم

آفلاین
user-avatar
حسین داودی ( 70 تجربه )
12 ماه پیش

@afsharafshin2020 لطفا از کسی sdk نخر چون sdk رو sdk manager از سایت رسمی خود sdk ( گوگل ) به شما sdk میده اگر مشکلی در اون دیدید مشکل ممکنه از سیستم ، sdk manager , اینترنت ضعیف و فیلتر ایران( دانلود نشدن یا ناقص بودن فایل ) یا از ویروس (بعضی از فایل هارو پاک کرده) باشه اگر از اینها نبود پس از مشکل اس دی کی نیست
شاید به gradle ربط داشته باشه

آفلاین
user-avatar
زهره ( 7070 تجربه )
11 ماه پیش

سلام من گریدلم بیلد نمیشه و این ارور رو دریافت میکنم
Error:No such property: GradleVersion for class: JetGradlePlugin

برای ارسال پاسخ باید وارد سایت شوید