آفلاین
user-avatar

مشکل در اجرای ری اکت نیتیو و خطا در installdebug

2 سال پیش
توسط امین پور آپدیت شد
آفلاین
user-avatar
Maryam GSH ( 75 تجربه )
2 سال پیش

با سلام
من قبلا با برنامه کار می کردم مشکلی نداشتم
اما الان این ارور برام میاد
چه راه حلی پیشنهاد میدین؟

"

FAILURE: Build failed with an exception.

  • What went wrong:
    Execution failed for task ':app:installDebug'.

    com.android.builder.testing.api.DeviceException: com.android.ddmlib.InstallException: Unknown failure (Error: Could not access the Package Manager. Is the system running?)

  • Try:
    Run with --stacktrace option to get the stack trace. Run with --info or --debug option to get more log output.

  • Get more help at https://help.gradle.org

BUILD FAILED in 15s
26 actionable tasks: 2 executed, 24 up-to-date
Could not install the app on the device, read the error above for details.
Make sure you have an Android emulator running or a device connected and have
set up your Android development environment:
https://facebook.github.io/react-native/docs/getting-started.html
"

اپدیتم کردم درست نشد
سپاس از توجه شما

آفلاین
user-avatar
امین پور ( 70 تجربه )
2 سال پیش

سلام
ببخشید این مشکل چطوری حل میشه؟

برای ارسال پاسخ باید وارد سایت شوید