آفلاین
user-avatar

خطا در اجرای اولیه ریکت نیتیو

2 سال پیش
توسط abtin20 آپدیت شد
آفلاین
user-avatar
abtin20 ( 50 تجربه )
2 سال پیش

سلام دوستان ببخشید من وقتی react-native run-androidرو میزنم این ارور رو میده در صورتی که شبی ساز فعاله
Exception in thread "main" java.util.zip.ZipException: error in opening zip file"
at java.util.zip.ZipFile.open(Native Method)
at java.util.zip.ZipFile.<init>(ZipFile.java:219)
at java.util.zip.ZipFile.<init>(ZipFile.java:149)
at java.util.zip.ZipFile.<init>(ZipFile.java:163)
at org.gradle.wrapper.Install.unzip(Install.java:159)
at org.gradle.wrapper.Install.access$500(Install.java:26)
at org.gradle.wrapper.Install$1.call(Install.java:69)
at org.gradle.wrapper.Install$1.call(Install.java:46)
at org.gradle.wrapper.ExclusiveFileAccessManager.access(ExclusiveFileAccessManager.java:65)
at org.gradle.wrapper.Install.createDist(Install.java:46)
at org.gradle.wrapper.WrapperExecutor.execute(WrapperExecutor.java:126)
at org.gradle.wrapper.GradleWrapperMain.main(GradleWrapperMain.java:61)
Could not install the app on the device, read the error above for details.
Make sure you have an Android emulator running or a device connected and have
set up your Android development environment:
"https://facebook.github.io/react-native/docs/getting-started.html

آفلاین
user-avatar
Ali Hamrani ( 1208 تجربه )
2 سال پیش

سلام شما باید در قسمت variable environment ویندوزتون JAVA_HOME و ANDROID_HOME را تعریف کنید

آفلاین
user-avatar
abtin20 ( 50 تجربه )
2 سال پیش

تنظیم کردم باز هم نمیشه

آفلاین
user-avatar
حسام موسوی ( 382959 تجربه )
2 سال پیش
تخصص : طراح و برنامه نویس

باید فایل gradle-2.4-all.zip رو پیدا کنید و بصورت دستی حذفش کنید البته عددهای که در اسم این فایل هست به نصب ورژن شما متغیره باید دنبال چنین فایلی بگردید در فولدر gradle و حذفش کنید

آفلاین
user-avatar
abtin20 ( 50 تجربه )
2 سال پیش

هیچ راه دیگه وجود نداره

آفلاین
user-avatar
abtin20 ( 50 تجربه )
2 سال پیش

ببخشید الان این خطا رو میده @hesammousavi
FAILURE: Build failed with an exception.

What went wrong:
A problem occurred configuring project ':app'.

Failed to find Build Tools revision ۲۶.۰.۳

Try:
Run with --stacktrace option to get the stack trace. Run with --info or --debug option to get more log output.

BUILD FAILED

Total time: ۱۴ mins ۴۸.۵۰۴ secs
Could not install the app on the device, read the error above for details.
Make sure you have an Android emulator running or a device connected and have
set up your Android development environment:
https://facebook.github.io/react-native/docs/getting-started.htm

برای ارسال پاسخ باید وارد سایت شوید