⏳۵۰٪ تخفیف فقط تا پایان جشنواره؛ بعدش همه‌چیز به قیمت قبل برمی‌گرده!

مشاهده دوره‌ها
ثانیه
دقیقه
ساعت
روز
راکت

ارور ران در فلاتر

بدون پاسخ

با سلام موقع اجرا پروژه فلاتر در وی اس کد این خطا و توضیحات رو برام میاره ممنون میشم راهنمایی کنید .

FAILURE: Build failed with an exception.

- What went wrong:  
  Could not open settings generic class cache for settings file 'C:\\Users\\Acer\\Documents\\codeyad\\TestEror\\flutterapplication1\\android\\settings.gradle' (C:\\Users\\Acer.gradle\\caches\\7.5\\scripts\\3d075fs9hjp81ny0sgym4v09w).

  > BUG! exception in phase 'semantic analysis' in source unit '*BuildScript*' Unsupported class file major version 63
- Try:

  > Run with --stacktrace option to get the stack trace.  
  > Run with --info or --debug option to get more log output.  
  > Run with --scan to get full insights.
- Get more help at <https://help.gradle.org>

BUILD FAILED in 3s  
Exception: Gradle task assembleDebug failed with exit code 1
ثبت پرسش جدید

پاسخ‌ها

0

هنوز پاسخی ثبت نشده

اولین نفری باشید که به این پرسش کمک می‌کند و مسیر حل مشکل را باز می‌کند.

اولین پاسخ را بنویسید

شاید پاسخ شما همین‌جا باشد

برای ارسال پاسخ لازم است وارد شده یا ثبت‌نام کنید

ورود یا ثبت‌نام